BDBM477269 5-chloro-2-(N-((1S,2R)-2-(6-fluoro-2,3-dimethylphenyl)-1-(5-oxo- 4,5-dihydro-1,3,4-oxadiazol-2-yl)propyl)sulfamoyl)benzamide::US10889555, Example 43::US10889555, Example 5::US11634395, Example 5
SMILES C[C@@H]([C@H](NS(=O)(=O)c1ccc(Cl)cc1C(N)=O)c1n[nH]c(=O)o1)c1c(F)ccc(C)c1C
InChI Key
Data  3 IC50
  Tab Delimited (TSV)   2D SDfile   Computed 3D by Vconf -m prep SDfile
Find this compound or compounds like it in BindingDB:
Activity Spreadsheet -- Enzyme Inhibition Constant Data from BindingDB
Found 2 hits for monomerid = 477269
TargetMuscarinic acetylcholine receptor M1/M2(Homo sapiens (Human))
Taiho Pharmaceutical
US Patent
LigandPNGBDBM477269(5-chloro-2-(N-((1S,2R)-2-(6-fluoro-2,3-dimethylphe...)
Affinity DataIC50:  140nM. Assay description: First, test compounds were serially diluted with DMSO. Next, human M1 protein and human M2 protein were added to an aqueous albumin solution derived ...
In DepthDetails US Patent
TargetMuscarinic acetylcholine receptor M1/M2(Homo sapiens (Human))
Taiho Pharmaceutical
US Patent
LigandPNGBDBM477269(5-chloro-2-(N-((1S,2R)-2-(6-fluoro-2,3-dimethylphe...)
Affinity DataIC50:  80nM. Assay description: First, test compounds were serially diluted with DMSO. Next, human M1 protein and human M2 protein were added to an aqueous albumin solution derived ...
In DepthDetails US Patent